Target
Complement C1s subcomponent
Ligand
BDBM40838
Substrate
Meas. Tech.
Complement factor C1s IC50 from mixture screen
IC50
>50000±0 nM
Citation
 PubChem, PC Complement factor C1s IC50 from mixture screen PubChem Bioassay (2008)[AID] 
Target
Name:
Complement C1s subcomponent
Synonyms:
C1 esterase C1S_HUMAN Complement C1s subcomponent Complement C1s subcomponent light chain Trypsin | complement component 1, s subcomponent
Type:
Protein
Mol. Mass.:
76657.91
Organism:
Homo sapiens (Human)
Description:
P09871
Residue:
688
  
Inhibitor
Name:
BDBM40838
Synonyms:
7-[(3,5-dimethoxy-4-oxidanyl-phenyl)-(pyridin-2-ylamino)methyl]-2-methyl-quinolin-8-ol 7-[(4-hydroxy-3,5-dimethoxyphenyl)(pyridin-2-ylamino)methyl]-2-methylquinolin-8-ol 7-[(4-hydroxy-3,5-dimethoxyphenyl)-(pyridin-2-ylamino)methyl]-2-methylquinolin-8-ol SMR000019923 | cid_3236321
Type:
Small organic molecule
Emp. Form.:
C24H23N3O4
Mol. Mass.:
417.4571
SMILES:
COc1cc(cc(OC)c1O)C(Nc1ccccn1)c1ccc2ccc(C)nc2c1O
: