Target
Complement C1s subcomponent
Ligand
BDBM40842
Substrate
Meas. Tech.
Complement factor C1s IC50 from mixture screen
IC50
>50000±0 nM
Citation
 PubChem, PC Complement factor C1s IC50 from mixture screen PubChem Bioassay (2008)[AID] 
Target
Name:
Complement C1s subcomponent
Synonyms:
C1 esterase C1S_HUMAN Complement C1s subcomponent Complement C1s subcomponent light chain Trypsin | complement component 1, s subcomponent
Type:
Protein
Mol. Mass.:
76657.91
Organism:
Homo sapiens (Human)
Description:
P09871
Residue:
688
  
Inhibitor
Name:
BDBM40842
Synonyms:
6,7-diethoxy-3-(2-oxolanylmethyl)-2-sulfanylidene-1H-quinazolin-4-one 6,7-diethoxy-3-(tetrahydrofuran-2-ylmethyl)-2-thioxo-2,3-dihydroquinazolin-4(1H)-one MLS000095445 cid_3237189
Type:
Small organic molecule
Emp. Form.:
C17H22N2O4S
Mol. Mass.:
350.433
SMILES:
CCOc1cc2[nH]c(=S)n(CC3CCCO3)c(=O)c2cc1OCC
: