Target
Complement C1s subcomponent
Ligand
BDBM40849
Substrate
Meas. Tech.
Complement factor C1s IC50 from mixture screen
IC50
>50000±0 nM
Citation
 PubChem, PC Complement factor C1s IC50 from mixture screen PubChem Bioassay (2008)[AID] 
Target
Name:
Complement C1s subcomponent
Synonyms:
C1 esterase C1S_HUMAN Complement C1s subcomponent Complement C1s subcomponent light chain Trypsin | complement component 1, s subcomponent
Type:
Protein
Mol. Mass.:
76657.91
Organism:
Homo sapiens (Human)
Description:
P09871
Residue:
688
  
Inhibitor
Name:
BDBM40849
Synonyms:
2-[(2-keto-2-p-cumenyl-ethyl)thio]-6-methyl-1H-pyrimidin-4-one 6-methyl-2-[2-oxidanylidene-2-(4-propan-2-ylphenyl)ethyl]sulfanyl-1H-pyrimidin-4-one 6-methyl-2-[[2-oxo-2-(4-propan-2-ylphenyl)ethyl]thio]-1H-pyrimidin-4-one SMR000082839 | cid_706561
Type:
Small organic molecule
Emp. Form.:
C16H18N2O2S
Mol. Mass.:
302.391
SMILES:
CC(C)c1ccc(cc1)C(=O)CSc1nc(C)cc(=O)[nH]1
: