Target
Complement C1s subcomponent
Ligand
BDBM40864
Substrate
Meas. Tech.
Complement factor C1s IC50 from mixture screen
IC50
>50000±0 nM
Citation
 PubChem, PC Complement factor C1s IC50 from mixture screen PubChem Bioassay (2008)[AID] 
Target
Name:
Complement C1s subcomponent
Synonyms:
C1 esterase C1S_HUMAN Complement C1s subcomponent Complement C1s subcomponent light chain Trypsin | complement component 1, s subcomponent
Type:
Protein
Mol. Mass.:
76657.91
Organism:
Homo sapiens (Human)
Description:
P09871
Residue:
688
  
Inhibitor
Name:
BDBM40864
Synonyms:
2-(cyclohexylthio)-N-(4-methoxyphenyl)acetamide 2-cyclohexylsulfanyl-N-(4-methoxyphenyl)ethanamide SMR000077514 | cid_734045
Type:
Small organic molecule
Emp. Form.:
C15H21NO2S
Mol. Mass.:
279.398
SMILES:
COc1ccc(NC(=O)CSC2CCCCC2)cc1
: