Target
Complement C1s subcomponent
Ligand
BDBM40871
Substrate
Meas. Tech.
Complement factor C1s IC50 from mixture screen
IC50
>50000±0 nM
Citation
 PubChem, PC Complement factor C1s IC50 from mixture screen PubChem Bioassay (2008)[AID] 
Target
Name:
Complement C1s subcomponent
Synonyms:
C1 esterase C1S_HUMAN Complement C1s subcomponent Complement C1s subcomponent light chain Trypsin | complement component 1, s subcomponent
Type:
Protein
Mol. Mass.:
76657.91
Organism:
Homo sapiens (Human)
Description:
P09871
Residue:
688
  
Inhibitor
Name:
BDBM40871
Synonyms:
1-(4-ethoxyphenyl)-3-[4-(2-fluorophenyl)-1-piperazinyl]-2,5-pyrrolidinedione 1-(4-ethoxyphenyl)-3-[4-(2-fluorophenyl)piperazin-1-yl]pyrrolidine-2,5-dione MLS000099180 cid_2896870
Type:
Small organic molecule
Emp. Form.:
C22H24FN3O3
Mol. Mass.:
397.4427
SMILES:
CCOc1ccc(cc1)-n1c(O)cc(N2CCN(CC2)c2ccccc2F)c1O
: