Target
Complement C1s subcomponent
Ligand
BDBM40875
Substrate
Meas. Tech.
Complement factor C1s IC50 from mixture screen
IC50
>50000±0 nM
Citation
 PubChem, PC Complement factor C1s IC50 from mixture screen PubChem Bioassay (2008)[AID] 
Target
Name:
Complement C1s subcomponent
Synonyms:
C1 esterase C1S_HUMAN Complement C1s subcomponent Complement C1s subcomponent light chain Trypsin | complement component 1, s subcomponent
Type:
Protein
Mol. Mass.:
76657.91
Organism:
Homo sapiens (Human)
Description:
P09871
Residue:
688
  
Inhibitor
Name:
BDBM40875
Synonyms:
MLS000050140 N-(2,4-dimethoxyphenyl)-1-(4-methylphenyl)sulfonyl-5-oxo-2-pyrrolidinecarboxamide N-(2,4-dimethoxyphenyl)-1-[(4-methylphenyl)sulfonyl]-5-oxoprolinamide SMR000077233 | cid_2957869
Type:
Small organic molecule
Emp. Form.:
C20H22N2O6S
Mol. Mass.:
418.463
SMILES:
COc1ccc(NC(=O)C2CCC(=O)N2S(=O)(=O)c2ccc(C)cc2)c(OC)c1
: