Target
Complement C1s subcomponent
Ligand
BDBM40888
Substrate
Meas. Tech.
Complement factor C1s IC50 from mixture screen
IC50
>50000±0 nM
Citation
 PubChem, PC Complement factor C1s IC50 from mixture screen PubChem Bioassay (2008)[AID] 
Target
Name:
Complement C1s subcomponent
Synonyms:
C1 esterase C1S_HUMAN Complement C1s subcomponent Complement C1s subcomponent light chain Trypsin | complement component 1, s subcomponent
Type:
Protein
Mol. Mass.:
76657.91
Organism:
Homo sapiens (Human)
Description:
P09871
Residue:
688
  
Inhibitor
Name:
BDBM40888
Synonyms:
2-(4,6-dimethyl-1-benzofuran-3-yl)-N-(2-furylmethyl)acetamide 2-(4,6-dimethyl-1-benzofuran-3-yl)-N-(furan-2-ylmethyl)ethanamide 2-(4,6-dimethylbenzofuran-3-yl)-N-(2-furfuryl)acetamide SMR000080135 | cid_1243461
Type:
Small organic molecule
Emp. Form.:
C17H17NO3
Mol. Mass.:
283.3218
SMILES:
Cc1cc(C)c2c(CC(=O)NCc3ccco3)coc2c1
: