Target
Complement C1s subcomponent
Ligand
BDBM40889
Substrate
Meas. Tech.
Complement factor C1s IC50 from mixture screen
IC50
>50000±0 nM
Citation
 PubChem, PC Complement factor C1s IC50 from mixture screen PubChem Bioassay (2008)[AID] 
Target
Name:
Complement C1s subcomponent
Synonyms:
C1 esterase C1S_HUMAN Complement C1s subcomponent Complement C1s subcomponent light chain Trypsin | complement component 1, s subcomponent
Type:
Protein
Mol. Mass.:
76657.91
Organism:
Homo sapiens (Human)
Description:
P09871
Residue:
688
  
Inhibitor
Name:
BDBM40889
Synonyms:
1-(4-methylbenzyl)-4-[4-(2-methylphenyl)-1-piperazinyl]-1H-pyrazolo[3,4-d]pyrimidine 1-[(4-methylphenyl)methyl]-4-[4-(2-methylphenyl)-1-piperazinyl]pyrazolo[3,4-d]pyrimidine MLS000049045 cid_1502520
Type:
Small organic molecule
Emp. Form.:
C24H26N6
Mol. Mass.:
398.5034
SMILES:
Cc1ccc(Cn2ncc3c(ncnc23)N2CCN(CC2)c2ccccc2C)cc1
: