Target
Focal adhesion kinase 1
Ligand
BDBM40980
Substrate
Meas. Tech.
Dose-response biochemical assay for inhibitors of Focal Adhesion Kinase (FAK)
IC50
2451±n/a nM
Citation
 PubChem, PC Dose-response biochemical assay for inhibitors of Focal Adhesion Kinase (FAK) PubChem Bioassay (2007)[AID] 
Target
Name:
Focal adhesion kinase 1
Synonyms:
FADK 1 FAK1 FLT4 Focal adhesion kinase (FAK) Focal adhesion kinase 1 (FAK) Focal adhesion kinase-related nonkinase PTK2 Protein-tyrosine kinase 2 p125FAK | pp125FAK
Type:
Tyrosine-protein kinase
Mol. Mass.:
119233.17
Organism:
Homo sapiens (Human)
Description:
Q05397
Residue:
1052
  
Inhibitor
Name:
BDBM40980
Synonyms:
3-[(2-chlorophenyl)sulfamoyl]-4-fluoranyl-benzoic acid 3-[(2-chlorophenyl)sulfamoyl]-4-fluorobenzoic acid MLS000089137 cid_891461
Type:
Small organic molecule
Emp. Form.:
C13H9ClFNO4S
Mol. Mass.:
329.731
SMILES:
OC(=O)c1ccc(F)c(c1)S(=O)(=O)Nc1ccccc1Cl
: