Target
Focal adhesion kinase 1
Ligand
BDBM41084
Substrate
Meas. Tech.
Dose-response biochemical assay for inhibitors of Focal Adhesion Kinase (FAK)
IC50
3247±n/a nM
Citation
 PubChem, PC Dose-response biochemical assay for inhibitors of Focal Adhesion Kinase (FAK) PubChem Bioassay (2007)[AID] 
Target
Name:
Focal adhesion kinase 1
Synonyms:
FADK 1 FAK1 FLT4 Focal adhesion kinase (FAK) Focal adhesion kinase 1 (FAK) Focal adhesion kinase-related nonkinase PTK2 Protein-tyrosine kinase 2 p125FAK | pp125FAK
Type:
Tyrosine-protein kinase
Mol. Mass.:
119233.17
Organism:
Homo sapiens (Human)
Description:
Q05397
Residue:
1052
  
Inhibitor
Name:
BDBM41084
Synonyms:
MLS000571311 N-(3-imidazo[1,2-a]pyridin-2-ylphenyl)-2-oxidanylidene-chromene-3-carboxamide N-(3-imidazo[1,2-a]pyridin-2-ylphenyl)-2-oxochromene-3-carboxamide SMR000193680 | cid_2877674
Type:
Small organic molecule
Emp. Form.:
C23H15N3O3
Mol. Mass.:
381.3835
SMILES:
O=C(Nc1cccc(c1)-c1cn2ccccc2n1)c1cc2ccccc2oc1=O
: