Target
Cathepsin B
Ligand
BDBM32756
Substrate
Meas. Tech.
Cathepsin B dose-response confirmation
IC50
1260.8±32.4 nM
Citation
 PubChem, PC Cathepsin B dose-response confirmation PubChem Bioassay (2008)[AID] 
Target
Name:
Cathepsin B
Synonyms:
APP secretase CATB_HUMAN CTSB Cathepsin B light chain | Cathepsin B1
Type:
Enzyme
Mol. Mass.:
37819.69
Organism:
Homo sapiens (Human)
Description:
gi_63102437
Residue:
339
  
Inhibitor
Name:
BDBM32756
Synonyms:
2-furancarboxylic acid [5-amino-1-(4-fluorophenyl)sulfonyl-3-pyrazolyl] ester Furan-2-carboxylic acid 5-amino-1-(4-fluoro-benzenesulfonyl)-1H-pyrazol-3-yl ester SMR000014918 [5-amino-1-(4-fluorophenyl)sulfonylpyrazol-3-yl] furan-2-carboxylate cid_647599 | furan-2-carboxylic acid [5-amino-1-(4-fluorophenyl)sulfonyl-pyrazol-3-yl] ester
Type:
Small organic molecule
Emp. Form.:
C14H10FN3O5S
Mol. Mass.:
351.31
SMILES:
Nc1cc(OC(=O)c2ccco2)nn1S(=O)(=O)c1ccc(F)cc1
: