Target
Cathepsin B
Ligand
BDBM41105
Substrate
Meas. Tech.
Cathepsin B dose-response confirmation
IC50
>50000±0 nM
Citation
 PubChem, PC Cathepsin B dose-response confirmation PubChem Bioassay (2008)[AID] 
Target
Name:
Cathepsin B
Synonyms:
APP secretase CATB_HUMAN CTSB Cathepsin B light chain | Cathepsin B1
Type:
Enzyme
Mol. Mass.:
37819.69
Organism:
Homo sapiens (Human)
Description:
gi_63102437
Residue:
339
  
Inhibitor
Name:
BDBM41105
Synonyms:
4-amino-N-[2-[[2-(2-fluorobenzyl)oxybenzyl]amino]ethyl]furazan-3-carboxamide;hydrochloride 4-azanyl-N-[2-[[2-[(2-fluorophenyl)methoxy]phenyl]methylamino]ethyl]-1,2,5-oxadiazole-3-carboxamide;hydrochloride SMR000047723 | cid_6603449
Type:
Small organic molecule
Emp. Form.:
C19H20FN5O3
Mol. Mass.:
385.3922
SMILES:
Nc1nonc1C(=O)NCCNCc1ccccc1OCc1ccccc1F
: