Target
Cathepsin B
Ligand
BDBM35500
Substrate
Meas. Tech.
Cathepsin B dose-response confirmation
IC50
4169.7±656.4 nM
Citation
 PubChem, PC Cathepsin B dose-response confirmation PubChem Bioassay (2008)[AID] 
Target
Name:
Cathepsin B
Synonyms:
APP secretase CATB_HUMAN CTSB Cathepsin B light chain | Cathepsin B1
Type:
Enzyme
Mol. Mass.:
37819.69
Organism:
Homo sapiens (Human)
Description:
gi_63102437
Residue:
339
  
Inhibitor
Name:
BDBM35500
Synonyms:
2-(4-chlorophenyl)sulfonyl-4,5-dimethyl-3,6-dihydro-1,2-thiazine 1-oxide MLS000048879 cid_794694
Type:
Small organic molecule
Emp. Form.:
C12H14ClNO3S2
Mol. Mass.:
319.827
SMILES:
CC1=C(C)CS(=O)N(C1)S(=O)(=O)c1ccc(Cl)cc1
: