Target
Cathepsin B
Ligand
BDBM41106
Substrate
Meas. Tech.
Cathepsin B dose-response confirmation
IC50
>50000±0 nM
Citation
 PubChem, PC Cathepsin B dose-response confirmation PubChem Bioassay (2008)[AID] 
Target
Name:
Cathepsin B
Synonyms:
APP secretase CATB_HUMAN CTSB Cathepsin B light chain | Cathepsin B1
Type:
Enzyme
Mol. Mass.:
37819.69
Organism:
Homo sapiens (Human)
Description:
gi_63102437
Residue:
339
  
Inhibitor
Name:
BDBM41106
Synonyms:
MLS000058460 N-(3-cyano-2-thiophenyl)-2-pyrazinecarboxamide SMR000068005 | cid_2612950
Type:
Small organic molecule
Emp. Form.:
C10H6N4OS
Mol. Mass.:
230.246
SMILES:
O=C(Nc1sccc1C#N)c1cnccn1
: