Target
Cathepsin B
Ligand
BDBM34323
Substrate
Meas. Tech.
Cathepsin B dose-response confirmation
IC50
9388.7±210 nM
Citation
 PubChem, PC Cathepsin B dose-response confirmation PubChem Bioassay (2008)[AID] 
Target
Name:
Cathepsin B
Synonyms:
APP secretase CATB_HUMAN CTSB Cathepsin B light chain | Cathepsin B1
Type:
Enzyme
Mol. Mass.:
37819.69
Organism:
Homo sapiens (Human)
Description:
gi_63102437
Residue:
339
  
Inhibitor
Name:
BDBM34323
Synonyms:
MLS000081951 N-[2-(benzenesulfonyl)-3,6-dihydrothiazin-1-ylidene]benzenesulfonamide SMR000061063 | cid_2998380
Type:
Small organic molecule
Emp. Form.:
C16H16N2O4S3
Mol. Mass.:
396.504
SMILES:
O=S(=O)(NS1=CC=CCN1S(=O)(=O)c1ccccc1)c1ccccc1
: