Target
Procathepsin L
Ligand
BDBM41123
Substrate
Meas. Tech.
Cathepsin L dose-response confirmation
IC50
>50000±0 nM
Citation
 PubChem, PC Cathepsin L dose-response confirmation PubChem Bioassay (2008)[AID] 
Target
Name:
Procathepsin L
Synonyms:
CATL1_HUMAN CTSL CTSL1 Cathepsin L Cathepsin L1 heavy chain MEP cathepsin L preproprotein
Type:
Enzyme
Mol. Mass.:
37557.19
Organism:
Homo sapiens (Human)
Description:
Purchased from Calbiochem (San Diego, CA).
Residue:
333
  
Inhibitor
Name:
BDBM41123
Synonyms:
MLS000075426 N-methyl-N-[5-(3-pyridinyl)-1,3,4-thiadiazol-2-yl]-3-oxolanecarboxamide SMR000000612 cid_645183
Type:
Small organic molecule
Emp. Form.:
C13H14N4O2S
Mol. Mass.:
290.341
SMILES:
CN(C(=O)C1CCOC1)c1nnc(s1)-c1cccnc1
: