Target
Procathepsin L
Ligand
BDBM41127
Substrate
Meas. Tech.
Cathepsin L dose-response confirmation
IC50
>50000±0 nM
Citation
 PubChem, PC Cathepsin L dose-response confirmation PubChem Bioassay (2008)[AID] 
Target
Name:
Procathepsin L
Synonyms:
CATL1_HUMAN CTSL CTSL1 Cathepsin L Cathepsin L1 heavy chain MEP cathepsin L preproprotein
Type:
Enzyme
Mol. Mass.:
37557.19
Organism:
Homo sapiens (Human)
Description:
Purchased from Calbiochem (San Diego, CA).
Residue:
333
  
Inhibitor
Name:
BDBM41127
Synonyms:
(5-Benzyl-4-furan-2-ylmethyl-4H-[1,2,4]triazol-3-ylsulfanyl)-acetic acid ethyl ester 2-[[5-benzyl-4-(2-furfuryl)-1,2,4-triazol-3-yl]thio]acetic acid ethyl ester SMR000002755 ethyl 2-[[4-(furan-2-ylmethyl)-5-(phenylmethyl)-1,2,4-triazol-3-yl]sulfanyl]ethanoate | ethyl 2-[[5-benzyl-4-(furan-2-ylmethyl)-1,2,4-triazol-3-yl]sulfanyl]acetate
Type:
Small organic molecule
Emp. Form.:
C18H19N3O3S
Mol. Mass.:
357.427
SMILES:
CCOC(=O)CSc1nnc(Cc2ccccc2)n1Cc1ccco1
: