Target
DNA-directed RNA polymerase subunit beta
Ligand
BDBM34233
Substrate
Meas. Tech.
RNA polymerase dose-response confirmation
IC50
11687.2±1934.53 nM
Citation
 PubChem, PC RNA polymerase dose-response confirmation PubChem Bioassay (2008)[AID] 
Target
Name:
DNA-directed RNA polymerase subunit beta
Synonyms:
RNA polymerase beta subunit (EC 2.7.7.6)
Type:
Enzyme Catalytic Domain
Mol. Mass.:
150595.80
Organism:
Escherichia coli
Description:
A0A0E2LB94
Residue:
1342
  
Inhibitor
Name:
BDBM34233
Synonyms:
2-Phenyl-benzo[d]isoselenazol-3-one 2-phenyl-1,2-benzisoselazol-3(2H)-one 2-phenylbenzo[d][1,2]selenazol-3(2H)-one EBSELEN MLS000028488 cid_3194 | med.21724, Compound 153
Type:
Small organic molecule
Emp. Form.:
C13H9NOSe
Mol. Mass.:
274.18
SMILES:
O=c1n([se]c2ccccc12)-c1ccccc1
: