Target
DNA-directed RNA polymerase subunit beta
Ligand
BDBM41213
Substrate
Meas. Tech.
RNA polymerase dose-response confirmation
IC50
>50000±0 nM
Citation
 PubChem, PC RNA polymerase dose-response confirmation PubChem Bioassay (2008)[AID] 
Target
Name:
DNA-directed RNA polymerase subunit beta
Synonyms:
RNA polymerase beta subunit (EC 2.7.7.6)
Type:
Enzyme Catalytic Domain
Mol. Mass.:
150595.80
Organism:
Escherichia coli
Description:
A0A0E2LB94
Residue:
1342
  
Inhibitor
Name:
BDBM41213
Synonyms:
MLS000037313 N-[4-[2-[(4-prop-2-enyl-5-thiophen-2-yl-1,2,4-triazol-3-yl)sulfanyl]acetyl]phenyl]benzenesulfonamide N-[4-[2-[[4-allyl-5-(2-thienyl)-1,2,4-triazol-3-yl]thio]acetyl]phenyl]benzenesulfonamide cid_660594
Type:
Small organic molecule
Emp. Form.:
C23H20N4O3S3
Mol. Mass.:
496.625
SMILES:
C=CCn1c(SCC(=O)c2ccc(NS(=O)(=O)c3ccccc3)cc2)nnc1-c1cccs1
: