Target
DNA-directed RNA polymerase subunit beta
Ligand
BDBM41275
Substrate
Meas. Tech.
RNA polymerase dose-response confirmation
IC50
>50000±0 nM
Citation
 PubChem, PC RNA polymerase dose-response confirmation PubChem Bioassay (2008)[AID] 
Target
Name:
DNA-directed RNA polymerase subunit beta
Synonyms:
RNA polymerase beta subunit (EC 2.7.7.6)
Type:
Enzyme Catalytic Domain
Mol. Mass.:
150595.80
Organism:
Escherichia coli
Description:
A0A0E2LB94
Residue:
1342
  
Inhibitor
Name:
BDBM41275
Synonyms:
14-hydroxy-7-hydroxyimino-14-azadispiro[5.1.5^{8}.2^{6}]pentadec-12-en-15-one 7-hydroxyimino-14-oxidanyl-14-azadispiro[5.1.5^{8}.2^{6}]pentadec-12-en-15-one SMR000054804 | cid_283081
Type:
Small organic molecule
Emp. Form.:
C14H20N2O3
Mol. Mass.:
264.3202
SMILES:
ON1C(=O)C2(CCCCC2)C(N=O)C11CCCC=C1
: