Target
Cathepsin S
Ligand
BDBM41302
Substrate
Meas. Tech.
Cathepsin S dose-response confirmation
IC50
>50000±0 nM
Citation
 PubChem, PC Cathepsin S dose-response confirmation PubChem Bioassay (2008)[AID] 
Target
Name:
Cathepsin S
Synonyms:
CATS_HUMAN Cathepsin S (Cat S) | cathepsin S preproprotein
Type:
Protein
Mol. Mass.:
37507.38
Organism:
Homo sapiens (Human)
Description:
P25774
Residue:
331
  
Inhibitor
Name:
BDBM41302
Synonyms:
6-(4-chlorophenyl)-3-phenyl-[1,2,4]triazolo[3,4-b][1,3,4]thiadiazole SMR000035078 | cid_661784
Type:
Small organic molecule
Emp. Form.:
C15H9ClN4S
Mol. Mass.:
312.777
SMILES:
Clc1ccc(cc1)-c1nn2c(nnc2s1)-c1ccccc1
: