Target
Cathepsin G
Ligand
BDBM40840
Substrate
Meas. Tech.
Cathepsin G dose-response confirmation
IC50
>50000±0 nM
Citation
 PubChem, PC Cathepsin G dose-response confirmation PubChem Bioassay (2008)[AID] 
Target
Name:
Cathepsin G
Synonyms:
CATG_HUMAN CTSG
Type:
PROTEIN
Mol. Mass.:
28860.08
Organism:
Homo sapiens (Human)
Description:
ChEMBL_1469016
Residue:
255
  
Inhibitor
Name:
BDBM40840
Synonyms:
5-(3,4-dimethoxyphenyl)-N-(4-methoxybenzyl)isoxazole-3-carboxamide 5-(3,4-dimethoxyphenyl)-N-[(4-methoxyphenyl)methyl]-3-isoxazolecarboxamide MLS000087123 cid_3236665
Type:
Small organic molecule
Emp. Form.:
C20H20N2O5
Mol. Mass.:
368.3832
SMILES:
COc1ccc(CNC(=O)c2cc(on2)-c2ccc(OC)c(OC)c2)cc1
: