Target
Cathepsin G
Ligand
BDBM41421
Substrate
Meas. Tech.
Cathepsin G dose-response confirmation
IC50
>50000±0 nM
Citation
 PubChem, PC Cathepsin G dose-response confirmation PubChem Bioassay (2008)[AID] 
Target
Name:
Cathepsin G
Synonyms:
CATG_HUMAN CTSG
Type:
PROTEIN
Mol. Mass.:
28860.08
Organism:
Homo sapiens (Human)
Description:
ChEMBL_1469016
Residue:
255
  
Inhibitor
Name:
BDBM41421
Synonyms:
1-(4-morpholinyl)-3-[[1-(phenylmethyl)-2-imidazolyl]thio]-1-propanone 3-(1-benzylimidazol-2-yl)sulfanyl-1-morpholin-4-ylpropan-1-one MLS000106778 cid_2853369
Type:
Small organic molecule
Emp. Form.:
C17H21N3O2S
Mol. Mass.:
331.433
SMILES:
O=C(CCSc1nccn1Cc1ccccc1)N1CCOCC1
: