Target
Ephrin type-B receptor 4
Ligand
BDBM41487
Substrate
Meas. Tech.
Dose-response biochemical assay for antagonists of the interaction between the Eph receptor B4 (EphB4) and its ligand ephrin-B2 via TNYL-RAW peptide
IC50
>79400±n/a nM
Citation
 PubChem, PC Dose-response biochemical assay for antagonists of the interaction between the Eph receptor B4 (EphB4) and its ligand ephrin-B2 via TNYL-RAW peptide PubChem Bioassay (2007)[AID] 
Target
Name:
Ephrin type-B receptor 4
Synonyms:
EPHB4 Ephrin receptor HTK MYK1 Tyrosine-protein kinase TYRO11 | VHL/Ephrin type-B receptor 4
Type:
Enzyme
Mol. Mass.:
108273.51
Organism:
Homo sapiens (Human)
Description:
P54760
Residue:
987
  
Inhibitor
Name:
BDBM41487
Synonyms:
3-(4-aminophenyl)sulfanyl-5-(trifluoromethyl)pyridine-2-carbonitrile 3-[(4-aminophenyl)thio]-5-(trifluoromethyl)-2-pyridinecarbonitrile MLS000540244 cid_1473758
Type:
Small organic molecule
Emp. Form.:
C13H8F3N3S
Mol. Mass.:
295.283
SMILES:
Nc1ccc(Sc2cc(cnc2C#N)C(F)(F)F)cc1
: