Target
Ephrin type-B receptor 4
Ligand
BDBM41507
Substrate
Meas. Tech.
Dose-response biochemical assay for antagonists of the interaction between the Eph receptor B4 (EphB4) and its ligand ephrin-B2 via TNYL-RAW peptide
IC50
>79400±n/a nM
Citation
 PubChem, PC Dose-response biochemical assay for antagonists of the interaction between the Eph receptor B4 (EphB4) and its ligand ephrin-B2 via TNYL-RAW peptide PubChem Bioassay (2007)[AID] 
Target
Name:
Ephrin type-B receptor 4
Synonyms:
EPHB4 Ephrin receptor HTK MYK1 Tyrosine-protein kinase TYRO11 | VHL/Ephrin type-B receptor 4
Type:
Enzyme
Mol. Mass.:
108273.51
Organism:
Homo sapiens (Human)
Description:
P54760
Residue:
987
  
Inhibitor
Name:
BDBM41507
Synonyms:
7-[(4-chlorophenyl)-[(5-methyl-1,2-oxazol-3-yl)amino]methyl]quinolin-8-ol 7-[(4-chlorophenyl)-[(5-methylisoxazol-3-yl)amino]methyl]quinolin-8-ol SMR000154608 | cid_3361499
Type:
Small organic molecule
Emp. Form.:
C20H16ClN3O2
Mol. Mass.:
365.813
SMILES:
Cc1cc(NC(c2ccc(Cl)cc2)c2ccc3cccnc3c2O)no1
: