Target
Ephrin type-B receptor 4
Ligand
BDBM41517
Substrate
Meas. Tech.
Dose-response biochemical assay for antagonists of the interaction between the Eph receptor B4 (EphB4) and its ligand ephrin-B2 via TNYL-RAW peptide
IC50
>79400±n/a nM
Citation
 PubChem, PC Dose-response biochemical assay for antagonists of the interaction between the Eph receptor B4 (EphB4) and its ligand ephrin-B2 via TNYL-RAW peptide PubChem Bioassay (2007)[AID] 
Target
Name:
Ephrin type-B receptor 4
Synonyms:
EPHB4 Ephrin receptor HTK MYK1 Tyrosine-protein kinase TYRO11 | VHL/Ephrin type-B receptor 4
Type:
Enzyme
Mol. Mass.:
108273.51
Organism:
Homo sapiens (Human)
Description:
P54760
Residue:
987
  
Inhibitor
Name:
BDBM41517
Synonyms:
3,4-Dimethoxy-benzoic acid (3-benzo[1,3]dioxol-5-ylmethyl-4-oxo-thiazolidin-2-ylidene)-hydrazide N-[(4-keto-3-piperonyl-thiazolidin-2-ylidene)amino]-3,4-dimethoxy-benzamide N-[[3-(1,3-benzodioxol-5-ylmethyl)-4-oxo-1,3-thiazolidin-2-ylidene]amino]-3,4-dimethoxybenzamide SMR000173096 | cid_3205851
Type:
Small organic molecule
Emp. Form.:
C20H19N3O6S
Mol. Mass.:
429.446
SMILES:
COc1ccc(cc1OC)C(=O)NN=C1SCC(=O)N1Cc1ccc2OCOc2c1
: