Target
Ephrin type-B receptor 4
Ligand
BDBM41525
Substrate
Meas. Tech.
Dose-response biochemical assay for antagonists of the interaction between the Eph receptor B4 (EphB4) and its ligand ephrin-B2 via TNYL-RAW peptide
IC50
>79400±n/a nM
Citation
 PubChem, PC Dose-response biochemical assay for antagonists of the interaction between the Eph receptor B4 (EphB4) and its ligand ephrin-B2 via TNYL-RAW peptide PubChem Bioassay (2007)[AID] 
Target
Name:
Ephrin type-B receptor 4
Synonyms:
EPHB4 Ephrin receptor HTK MYK1 Tyrosine-protein kinase TYRO11 | VHL/Ephrin type-B receptor 4
Type:
Enzyme
Mol. Mass.:
108273.51
Organism:
Homo sapiens (Human)
Description:
P54760
Residue:
987
  
Inhibitor
Name:
BDBM41525
Synonyms:
1-(4-fluorobenzyl)-3-(2-nitrovinyl)-1H-indole 1-[(4-fluorophenyl)methyl]-3-[(E)-2-nitroethenyl]indole SMR000198179 | cid_889149
Type:
Small organic molecule
Emp. Form.:
C17H13FN2O2
Mol. Mass.:
296.2957
SMILES:
[O-][N+](=O)\C=C\c1cn(Cc2ccc(F)cc2)c2ccccc12
: