Target
Sphingosine 1-phosphate receptor 2
Ligand
BDBM39773
Substrate
Meas. Tech.
Dose Response Cell Based Assay for Antagonists of the S1P2 Receptor
IC50
2939±n/a nM
Citation
 PubChem, PC Dose Response Cell Based Assay for Antagonists of the S1P2 Receptor PubChem Bioassay (2007)[AID] 
Target
Name:
Sphingosine 1-phosphate receptor 2
Synonyms:
EDG5 S1PR2 Sphingosine 1-phosphate receptor Sphingosine-1-phosphate receptor 2 | ndothelial differentiation G-protein coupled receptor 5
Type:
G Protein-Coupled Receptor (GPCR)
Mol. Mass.:
38883.16
Organism:
Homo sapiens (Human)
Description:
Membranes isolated from S1P2-transfected CHO cells were used in ligand binding assay.
Residue:
353
  
Inhibitor
Name:
BDBM39773
Synonyms:
(2Z)-3-ethyl-2-[(1-ethyl-8-methyl-2-quinolin-1-iumyl)methylidene]-1,3-benzothiazole;iodide (2Z)-3-ethyl-2-[(1-ethyl-8-methyl-quinolin-1-ium-2-yl)methylidene]-1,3-benzothiazole;iodide 1-Ethyl-2-(3-ethyl-3H-benzothiazol-2-ylidenemethyl)-8-methyl-quinolinium SMR000177972 | cid_11958727
Type:
Small organic molecule
Emp. Form.:
C22H23N2S
Mol. Mass.:
347.496
SMILES:
CCN1\C(Sc2ccccc12)=C\c1ccc2cccc(C)c2[n+]1CC
: