Target
Sphingosine 1-phosphate receptor 2
Ligand
BDBM41645
Substrate
Meas. Tech.
Dose Response Cell Based Assay for Agonists of the S1P2 Receptor
EC50
>50000±n/a nM
Citation
 PubChem, PC Dose Response Cell Based Assay for Agonists of the S1P2 Receptor PubChem Bioassay (2007)[AID] 
Target
Name:
Sphingosine 1-phosphate receptor 2
Synonyms:
EDG5 S1PR2 Sphingosine 1-phosphate receptor Sphingosine-1-phosphate receptor 2 | ndothelial differentiation G-protein coupled receptor 5
Type:
G Protein-Coupled Receptor (GPCR)
Mol. Mass.:
38883.16
Organism:
Homo sapiens (Human)
Description:
Membranes isolated from S1P2-transfected CHO cells were used in ligand binding assay.
Residue:
353
  
Inhibitor
Name:
BDBM41645
Synonyms:
2-(2-furanyl)-8-methoxy-3-[(4-methoxyphenyl)methyl][1]benzopyrano[2,3-d]pyrimidine-4,5-dione 2-(furan-2-yl)-8-methoxy-3-[(4-methoxyphenyl)methyl]chromeno[2,3-d]pyrimidine-4,5-dione SMR000047202 | cid_665980
Type:
Small organic molecule
Emp. Form.:
C24H18N2O6
Mol. Mass.:
430.4095
SMILES:
COc1ccc(Cn2c(nc3oc4cc(OC)ccc4c(=O)c3c2=O)-c2ccco2)cc1
: