Target
Sphingosine 1-phosphate receptor 2
Ligand
BDBM41681
Substrate
Meas. Tech.
Dose Response Cell Based Assay for Agonists of the S1P2 Receptor
EC50
2889±n/a nM
Citation
 PubChem, PC Dose Response Cell Based Assay for Agonists of the S1P2 Receptor PubChem Bioassay (2007)[AID] 
Target
Name:
Sphingosine 1-phosphate receptor 2
Synonyms:
EDG5 S1PR2 Sphingosine 1-phosphate receptor Sphingosine-1-phosphate receptor 2 | ndothelial differentiation G-protein coupled receptor 5
Type:
G Protein-Coupled Receptor (GPCR)
Mol. Mass.:
38883.16
Organism:
Homo sapiens (Human)
Description:
Membranes isolated from S1P2-transfected CHO cells were used in ligand binding assay.
Residue:
353
  
Inhibitor
Name:
BDBM41681
Synonyms:
3-(1,3-benzothiazol-2-yl)-1-(4-chlorobenzyl)-2(1H)-pyridinone 3-(1,3-benzothiazol-2-yl)-1-[(4-chlorophenyl)methyl]-2-pyridinone MLS000327557 cid_1472014
Type:
Small organic molecule
Emp. Form.:
C19H13ClN2OS
Mol. Mass.:
352.837
SMILES:
Clc1ccc(Cn2cccc(-c3nc4ccccc4s3)c2=O)cc1
: