Target
Sphingosine 1-phosphate receptor 2
Ligand
BDBM41723
Substrate
Meas. Tech.
Dose Response Cell Based Assay for Agonists of the S1P2 Receptor of Purchased Analogues
EC50
>30000±n/a nM
Citation
 PubChem, PC Dose Response Cell Based Assay for Agonists of the S1P2 Receptor of Purchased Analogues PubChem Bioassay (2007)[AID] 
Target
Name:
Sphingosine 1-phosphate receptor 2
Synonyms:
EDG5 S1PR2 Sphingosine 1-phosphate receptor Sphingosine-1-phosphate receptor 2 | ndothelial differentiation G-protein coupled receptor 5
Type:
G Protein-Coupled Receptor (GPCR)
Mol. Mass.:
38883.16
Organism:
Homo sapiens (Human)
Description:
Membranes isolated from S1P2-transfected CHO cells were used in ligand binding assay.
Residue:
353
  
Inhibitor
Name:
BDBM41723
Synonyms:
1-benzyl-2,5-dimethyl-pyrrole-3-carboxylic acid ethyl ester SR-01000099673-3 ethyl 1-benzyl-2,5-dimethylpyrrole-3-carboxylate | ethyl 2,5-dimethyl-1-(phenylmethyl)pyrrole-3-carboxylate
Type:
Small organic molecule
Emp. Form.:
C16H19NO2
Mol. Mass.:
257.3276
SMILES:
CCOC(=O)c1cc(C)n(Cc2ccccc2)c1C
: