Target
Sphingosine 1-phosphate receptor 2
Ligand
BDBM41727
Substrate
Meas. Tech.
Dose Response Cell Based Assay for Agonists of the S1P2 Receptor of Purchased Analogues
EC50
>30000±n/a nM
Citation
 PubChem, PC Dose Response Cell Based Assay for Agonists of the S1P2 Receptor of Purchased Analogues PubChem Bioassay (2007)[AID] 
Target
Name:
Sphingosine 1-phosphate receptor 2
Synonyms:
EDG5 S1PR2 Sphingosine 1-phosphate receptor Sphingosine-1-phosphate receptor 2 | ndothelial differentiation G-protein coupled receptor 5
Type:
G Protein-Coupled Receptor (GPCR)
Mol. Mass.:
38883.16
Organism:
Homo sapiens (Human)
Description:
Membranes isolated from S1P2-transfected CHO cells were used in ligand binding assay.
Residue:
353
  
Inhibitor
Name:
BDBM41727
Synonyms:
5-methyl-2-furancarboxylic acid [2-[2,5-dimethyl-1-(phenylmethyl)-3-pyrrolyl]-2-oxoethyl] ester SR-01000759086-1 [2-[2,5-dimethyl-1-(phenylmethyl)pyrrol-3-yl]-2-oxidanylidene-ethyl] 5-methylfuran-2-carboxylate | cid_9105373
Type:
Small organic molecule
Emp. Form.:
C21H21NO4
Mol. Mass.:
351.3957
SMILES:
Cc1ccc(o1)C(=O)OCC(=O)c1cc(C)n(Cc2ccccc2)c1C
: