Target
Sphingosine 1-phosphate receptor 2
Ligand
BDBM41736
Substrate
Meas. Tech.
Dose Response Cell Based Assay for Agonists of the S1P2 Receptor of Purchased Analogues
EC50
>30000±n/a nM
Citation
 PubChem, PC Dose Response Cell Based Assay for Agonists of the S1P2 Receptor of Purchased Analogues PubChem Bioassay (2007)[AID] 
Target
Name:
Sphingosine 1-phosphate receptor 2
Synonyms:
EDG5 S1PR2 Sphingosine 1-phosphate receptor Sphingosine-1-phosphate receptor 2 | ndothelial differentiation G-protein coupled receptor 5
Type:
G Protein-Coupled Receptor (GPCR)
Mol. Mass.:
38883.16
Organism:
Homo sapiens (Human)
Description:
Membranes isolated from S1P2-transfected CHO cells were used in ligand binding assay.
Residue:
353
  
Inhibitor
Name:
BDBM41736
Synonyms:
3-[2-(1-benzyl-2,5-dimethyl-pyrrol-3-yl)-2-keto-ethyl]-5,6-dimethyl-thieno[2,3-d]pyrimidin-4-one 3-[2-[2,5-dimethyl-1-(phenylmethyl)-3-pyrrolyl]-2-oxoethyl]-5,6-dimethyl-4-thieno[2,3-d]pyrimidinone SR-01000759090-1 | cid_7629932
Type:
Small organic molecule
Emp. Form.:
C23H23N3O2S
Mol. Mass.:
405.513
SMILES:
Cc1cc(C(=O)Cn2cnc3sc(C)c(C)c3c2=O)c(C)n1Cc1ccccc1
: