Target
Serine/threonine-protein kinase PLK1
Ligand
BDBM40208
Substrate
Meas. Tech.
Concentration Response Redox Cycling H2O2 Generation assay to characterize small molecule inhibitors identified in the Polo box domain (PBD) of Plk1 Primary HTS.
EC50
>50000±n/a nM
Citation
 PubChem, PC Concentration Response Redox Cycling H2O2 Generation assay to characterize small molecule inhibitors identified in the Polo box domain (PBD) of Plk1 Primary HTS. PubChem Bioassay (2007)[AID] 
Target
Name:
Serine/threonine-protein kinase PLK1
Synonyms:
PLK PLK1 Polo-like kinase 1 (PlK1) STPK13 Serine/threonine-protein kinase 13 | polo-like kinase
Type:
Serine/threonine-protein kinase
Mol. Mass.:
68277.16
Organism:
Homo sapiens (Human)
Description:
P53350
Residue:
603
  
Inhibitor
Name:
BDBM40208
Synonyms:
MLS000522634 N-(1,3-benzothiazol-2-yl)-4H-thieno[3,2-c]chromene-2-carboxamide cid_9550946
Type:
Small organic molecule
Emp. Form.:
C19H12N2O2S2
Mol. Mass.:
364.441
SMILES:
O=C(Nc1nc2ccccc2s1)c1cc2COc3ccccc3-c2s1
: