Target
Serine/threonine-protein kinase PLK1
Ligand
BDBM41838
Substrate
Meas. Tech.
Concentration Response Redox Cycling H2O2 Generation assay to characterize small molecule inhibitors identified in the Polo box domain (PBD) of Plk1 Primary HTS.
EC50
>50000±n/a nM
Citation
 PubChem, PC Concentration Response Redox Cycling H2O2 Generation assay to characterize small molecule inhibitors identified in the Polo box domain (PBD) of Plk1 Primary HTS. PubChem Bioassay (2007)[AID] 
Target
Name:
Serine/threonine-protein kinase PLK1
Synonyms:
PLK PLK1 Polo-like kinase 1 (PlK1) STPK13 Serine/threonine-protein kinase 13 | polo-like kinase
Type:
Serine/threonine-protein kinase
Mol. Mass.:
68277.16
Organism:
Homo sapiens (Human)
Description:
P53350
Residue:
603
  
Inhibitor
Name:
BDBM41838
Synonyms:
2-(2,1,3-benzothiadiazol-4-ylsulfonyl)-5-(4-bromophenyl)-3-pyrazolamine MLS000523036 [5-(4-bromophenyl)-2-piazthiol-4-ylsulfonyl-pyrazol-3-yl]amine | cid_11957251
Type:
Small organic molecule
Emp. Form.:
C15H10BrN5O2S2
Mol. Mass.:
436.306
SMILES:
Nc1cc(nn1S(=O)(=O)c1cccc2nsnc12)-c1ccc(Br)cc1
: