Target
Serine/threonine-protein kinase PLK1
Ligand
BDBM40726
Substrate
Meas. Tech.
Concentration Response Redox Cycling H2O2 Generation assay to characterize small molecule inhibitors identified in the Polo box domain (PBD) of Plk1 Primary HTS.
EC50
13279.00028±n/a nM
Citation
 PubChem, PC Concentration Response Redox Cycling H2O2 Generation assay to characterize small molecule inhibitors identified in the Polo box domain (PBD) of Plk1 Primary HTS. PubChem Bioassay (2007)[AID] 
Target
Name:
Serine/threonine-protein kinase PLK1
Synonyms:
PLK PLK1 Polo-like kinase 1 (PlK1) STPK13 Serine/threonine-protein kinase 13 | polo-like kinase
Type:
Serine/threonine-protein kinase
Mol. Mass.:
68277.16
Organism:
Homo sapiens (Human)
Description:
P53350
Residue:
603
  
Inhibitor
Name:
BDBM40726
Synonyms:
(6-bromopiazthiol-5-yl)amine 5-bromo-2,1,3-benzothiadiazol-6-amine MLS000556153 cid_3096032
Type:
Small organic molecule
Emp. Form.:
C6H4BrN3S
Mol. Mass.:
230.085
SMILES:
Nc1cc2nsnc2cc1Br
: