Target
Serine/threonine-protein kinase PLK1
Ligand
BDBM41819
Substrate
Meas. Tech.
Concentration Response fluorescence polarization-based assay to confirm small molecule inhibitors identified in the Polo box domain (PBD) of Plk1 Primary HTS.
IC50
>50000±n/a nM
Citation
 PubChem, PC Concentration Response fluorescence polarization-based assay to confirm small molecule inhibitors identified in the Polo box domain (PBD) of Plk1 Primary HTS. PubChem Bioassay (2007)[AID] 
Target
Name:
Serine/threonine-protein kinase PLK1
Synonyms:
PLK PLK1 Polo-like kinase 1 (PlK1) STPK13 Serine/threonine-protein kinase 13 | polo-like kinase
Type:
Serine/threonine-protein kinase
Mol. Mass.:
68277.16
Organism:
Homo sapiens (Human)
Description:
P53350
Residue:
603
  
Inhibitor
Name:
BDBM41819
Synonyms:
3-(isopropylthio)-6,6,7-trimethyl-1-morpholino-5,8-dihydro-2,7-naphthyridine-4-carbonitrile 6,6,7-trimethyl-1-(4-morpholinyl)-3-(propan-2-ylthio)-5,8-dihydro-2,7-naphthyridine-4-carbonitrile MLS000552515 cid_3790338
Type:
Small organic molecule
Emp. Form.:
C19H28N4OS
Mol. Mass.:
360.517
SMILES:
CC(C)Sc1nc(N2CCOCC2)c2CN(C)C(C)(C)Cc2c1C#N
: