Target
Serine/threonine-protein kinase PLK1
Ligand
BDBM41831
Substrate
Meas. Tech.
Concentration Response fluorescence polarization-based assay to confirm small molecule inhibitors identified in the Polo box domain (PBD) of Plk1 Primary HTS.
IC50
32933.99811±n/a nM
Citation
 PubChem, PC Concentration Response fluorescence polarization-based assay to confirm small molecule inhibitors identified in the Polo box domain (PBD) of Plk1 Primary HTS. PubChem Bioassay (2007)[AID] 
Target
Name:
Serine/threonine-protein kinase PLK1
Synonyms:
PLK PLK1 Polo-like kinase 1 (PlK1) STPK13 Serine/threonine-protein kinase 13 | polo-like kinase
Type:
Serine/threonine-protein kinase
Mol. Mass.:
68277.16
Organism:
Homo sapiens (Human)
Description:
P53350
Residue:
603
  
Inhibitor
Name:
BDBM41831
Synonyms:
Acetic acid N'-[3-oxo-3H-benzo[b]thiophen-(2Z)-ylidene]-N-m-tolyl-hydrazide N-(3-methylphenyl)-N-[(3-oxidanylidene-1-benzothiophen-2-ylidene)amino]ethanamide N-[(3-ketobenzothiophen-2-ylidene)amino]-N-(m-tolyl)acetamide SMR000146279 | cid_759945
Type:
Small organic molecule
Emp. Form.:
C17H14N2O2S
Mol. Mass.:
310.37
SMILES:
CC(=O)N(N=C1Sc2ccccc2C1=O)c1cccc(C)c1
: