Target
Alkaline phosphatase, germ cell type
Ligand
BDBM41867
Substrate
Meas. Tech.
Luminescent assay for identification of inhibitors of human intestinal alkaline phosphatase
IC50
>100000±n/a nM
Citation
 PubChem, PC Luminescent assay for identification of inhibitors of human intestinal alkaline phosphatase PubChem Bioassay (2009)[AID] 
Target
Name:
Alkaline phosphatase, germ cell type
Synonyms:
ALPG ALPPL2 PPBN_HUMAN | placental-like alkaline phosphatase preproprotein
Type:
PROTEIN
Mol. Mass.:
57374.31
Organism:
Homo sapiens (Human)
Description:
ChEMBL_29964
Residue:
532
  
Inhibitor
Name:
BDBM41867
Synonyms:
5-(1-naphthalenyl)-1,2-dihydropyrazol-3-one 5-naphthalen-1-yl-1,2-dihydropyrazol-3-one cid_610864
Type:
Small organic molecule
Emp. Form.:
C13H10N2O
Mol. Mass.:
210.2313
SMILES:
O=c1cc([nH][nH]1)-c1cccc2ccccc12
: