Target
Alkaline phosphatase, germ cell type
Ligand
BDBM41889
Substrate
Meas. Tech.
Luminescent assay for identification of inhibitors of human intestinal alkaline phosphatase
IC50
64600±n/a nM
Citation
 PubChem, PC Luminescent assay for identification of inhibitors of human intestinal alkaline phosphatase PubChem Bioassay (2009)[AID] 
Target
Name:
Alkaline phosphatase, germ cell type
Synonyms:
ALPG ALPPL2 PPBN_HUMAN | placental-like alkaline phosphatase preproprotein
Type:
PROTEIN
Mol. Mass.:
57374.31
Organism:
Homo sapiens (Human)
Description:
ChEMBL_29964
Residue:
532
  
Inhibitor
Name:
BDBM41889
Synonyms:
1-(3,4-dihydroxyphenyl)-2-(2-methyl-1-imidazolyl)ethanone;hydrochloride 1-[3,4-bis(oxidanyl)phenyl]-2-(2-methylimidazol-1-yl)ethanone;hydrochloride MLS-0315852.0001 | cid_25067491
Type:
Small organic molecule
Emp. Form.:
C12H12N2O3
Mol. Mass.:
232.2353
SMILES:
Cc1nccn1CC(=O)c1ccc(O)c(O)c1
: