Target
Dual specificity protein phosphatase 6
Ligand
BDBM31751
Substrate
Meas. Tech.
MKP-3 in vitro secondary assay for identification of irreversible and slow-binding inhibitors
IC50
31200±1100 nM
Citation
 PubChem, PC MKP-3 in vitro secondary assay for identification of irreversible and slow-binding inhibitors PubChem Bioassay (2008)[AID] 
Target
Name:
Dual specificity protein phosphatase 6
Synonyms:
DUS6_RAT MAP kinase phosphatase 3 Mitogen-activated protein kinase phosphatase 3 | Mkp3
Type:
Enzyme
Mol. Mass.:
42303.19
Organism:
Rattus norvegicus
Description:
gi_16758752
Residue:
381
  
Inhibitor
Name:
BDBM31751
Synonyms:
3-[(2-chlorobenzyl)thio]-5,6-bis(2-furyl)-1,2,4-triazine 3-[(2-chlorophenyl)methylthio]-5,6-bis(2-furanyl)-1,2,4-triazine cid_6400942
Type:
Small organic molecule
Emp. Form.:
C18H12ClN3O2S
Mol. Mass.:
369.825
SMILES:
Clc1ccccc1CSc1nnc(-c2ccco2)c(n1)-c1ccco1
: