Target
Mothers against decapentaplegic homolog 3
Ligand
BDBM41981
Substrate
Meas. Tech.
SMAD Transcription Factor Inhibitors Secondary Dose Response Confirmation
IC50
10067.79149±n/a nM
Citation
 PubChem, PC SMAD Transcription Factor Inhibitors Secondary Dose Response Confirmation PubChem Bioassay (2008)[AID] 
Target
Name:
Mothers against decapentaplegic homolog 3
Synonyms:
MADH3 SMAD3_HUMAN
Type:
Enzyme Catalytic Domain
Mol. Mass.:
48085.78
Organism:
Homo sapiens (Human)
Description:
gi_5174513
Residue:
425
  
Inhibitor
Name:
BDBM41981
Synonyms:
6-[(3-methoxy-4-oxidanyl-phenyl)-morpholin-4-yl-methyl]-1,3-benzodioxol-5-ol 6-[(4-hydroxy-3-methoxyphenyl)-(4-morpholinyl)methyl]-1,3-benzodioxol-5-ol cid_339895
Type:
Small organic molecule
Emp. Form.:
C19H21NO6
Mol. Mass.:
359.3731
SMILES:
COc1cc(ccc1O)C(N1CCOCC1)c1cc2OCOc2cc1O
: