Target
Bcl-2-related protein A1
Ligand
BDBM34183
Substrate
Meas. Tech.
In Vitro Bfl-1 Dose Response Fluorescence Polarization Assay for SAR Study
IC50
5360±720 nM
Citation
 PubChem, PC In Vitro Bfl-1 Dose Response Fluorescence Polarization Assay for SAR Study PubChem Bioassay (2008)[AID] 
Target
Name:
Bcl-2-related protein A1
Synonyms:
A1 B-cell leukemia/lymphoma 2 related protein A1a Bcl2a1 Bfl-1 Hemopoietic-specific early response protein | Protein BFL-1
Type:
Apoptosis regulator protein
Mol. Mass.:
19909.74
Organism:
Mus musculus (Mouse)
Description:
gi_11024684
Residue:
172
  
Inhibitor
Name:
BDBM34183
Synonyms:
2-[4-phenyl-6-(trifluoromethyl)pyrimidin-2-yl]sulfonylacetic acid ethyl ester MLS000049112 cid_1151859 ethyl 2-[4-phenyl-6-(trifluoromethyl)pyrimidin-2-yl]sulfonylethanoate | ethyl {[4-phenyl-6-(trifluoromethyl)-2-pyrimidinyl]sulfonyl}acetate
Type:
Small organic molecule
Emp. Form.:
C15H13F3N2O4S
Mol. Mass.:
374.335
SMILES:
CCOC(=O)CS(=O)(=O)c1nc(cc(n1)C(F)(F)F)-c1ccccc1
: