Target
Bcl-2-related protein A1
Ligand
BDBM39148
Substrate
Meas. Tech.
In Vitro Bfl-1 Dose Response Fluorescence Polarization Assay for SAR Study
IC50
1320±280 nM
Citation
 PubChem, PC In Vitro Bfl-1 Dose Response Fluorescence Polarization Assay for SAR Study PubChem Bioassay (2008)[AID] 
Target
Name:
Bcl-2-related protein A1
Synonyms:
A1 B-cell leukemia/lymphoma 2 related protein A1a Bcl2a1 Bfl-1 Hemopoietic-specific early response protein | Protein BFL-1
Type:
Apoptosis regulator protein
Mol. Mass.:
19909.74
Organism:
Mus musculus (Mouse)
Description:
gi_11024684
Residue:
172
  
Inhibitor
Name:
BDBM39148
Synonyms:
3-chloranyl-1-(3,4-dichlorophenyl)-4-[(3S)-3-methylpiperazin-1-yl]pyrrole-2,5-dione 3-chloro-1-(3,4-dichlorophenyl)-4-[(3S)-3-methylpiperazin-1-yl]pyrrole-2,5-dione MLS-0090858.0001 | cid_16654654
Type:
Small organic molecule
Emp. Form.:
C15H14Cl3N3O2
Mol. Mass.:
374.65
SMILES:
C[C@H]1CN(CCN1)C1=C(Cl)C(=O)N(C1=O)c1ccc(Cl)c(Cl)c1
: