Target
Heat shock 70 kDa protein 1A
Ligand
BDBM31734
Substrate
Meas. Tech.
In Vitro Hsp70 Dose Response Fluorescence Polarization Assay for SAR Study
IC50
5560±450 nM
Citation
 PubChem, PC In Vitro Hsp70 Dose Response Fluorescence Polarization Assay for SAR Study PubChem Bioassay (2008)[AID] 
Target
Name:
Heat shock 70 kDa protein 1A
Synonyms:
HSPA1A V9GZ37_HUMAN | heat shock 70kDa protein 1A
Type:
ATP-binding protein
Mol. Mass.:
51937.99
Organism:
Homo sapiens (Human)
Description:
gi_123271505; GST-tagged ATPase domain
Residue:
476
  
Inhibitor
Name:
BDBM31734
Synonyms:
8-carbethoxy-3a,4,5,9b-tetrahydro-3H-cyclopenta[c]quinoline-4-carboxylic acid MLS-0025126.0001 cid_2859888
Type:
Small organic molecule
Emp. Form.:
C16H17NO4
Mol. Mass.:
287.3105
SMILES:
CCOC(=O)c1ccc2NC(C3CC=CC3c2c1)C(O)=O
: