Target
Estrogen receptor
Ligand
BDBM42012
Substrate
Meas. Tech.
Estrogen Receptor-alpha Coactivator Binding Inhibitors ELISA Secondary Assay
IC50
30±n/a nM
Citation
 PubChem, PC Estrogen Receptor-alpha Coactivator Binding Inhibitors ELISA Secondary Assay PubChem Bioassay (2008)[AID] 
Target
Name:
Estrogen receptor
Synonyms:
ER ESR ESR1_HUMAN Estrogen receptor Estrogen receptor (ER-alpha) Estrogen receptor alpha (ER) Nuclear receptor subfamily 3 group A member 1
Type:
Protein
Mol. Mass.:
66230.44
Organism:
Homo sapiens (Human)
Description:
P03372
Residue:
595
  
Inhibitor
Name:
BDBM42012
Synonyms:
3-[6-keto-6-[4-(4-pyridyl)piperazino]hexyl]-2-thioxo-1H-quinazolin-4-one 3-[6-oxo-6-(4-pyridin-4-yl-1-piperazinyl)hexyl]-2-sulfanylidene-1H-quinazolin-4-one AS-1001-45a | cid_24178274
Type:
Small organic molecule
Emp. Form.:
C23H27N5O2S
Mol. Mass.:
437.558
SMILES:
O=C(CCCCCn1c(=S)[nH]c2ccccc2c1=O)N1CCN(CC1)c1ccncc1
: