Target
Estrogen receptor
Ligand
BDBM42014
Substrate
Meas. Tech.
Estrogen Receptor-alpha Coactivator Binding Inhibitors ELISA Secondary Assay
IC50
180±n/a nM
Citation
 PubChem, PC Estrogen Receptor-alpha Coactivator Binding Inhibitors ELISA Secondary Assay PubChem Bioassay (2008)[AID] 
Target
Name:
Estrogen receptor
Synonyms:
ER ESR ESR1_HUMAN Estrogen receptor Estrogen receptor (ER-alpha) Estrogen receptor alpha (ER) Nuclear receptor subfamily 3 group A member 1
Type:
Protein
Mol. Mass.:
66230.44
Organism:
Homo sapiens (Human)
Description:
P03372
Residue:
595
  
Inhibitor
Name:
BDBM42014
Synonyms:
3-[6-(4-anilino-1-piperidinyl)-6-oxohexyl]-2-sulfanylidene-1H-quinazolin-4-one 3-[6-(4-anilinopiperidino)-6-keto-hexyl]-2-thioxo-1H-quinazolin-4-one AS-1010-56a | cid_24178278
Type:
Small organic molecule
Emp. Form.:
C25H30N4O2S
Mol. Mass.:
450.596
SMILES:
O=C(CCCCCn1c(=S)[nH]c2ccccc2c1=O)N1CCC(CC1)Nc1ccccc1
: