Target
Galanin receptor type 2
Ligand
BDBM42067
Substrate
Meas. Tech.
Dose Response cell-based high-throughput screening assay to identify antagonists of galanin receptor 2 (GALR2)
IC50
>42000±n/a nM
Citation
 PubChem, PC Dose Response cell-based high-throughput screening assay to identify antagonists of galanin receptor 2 (GALR2) PubChem Bioassay (2008)[AID] 
Target
Name:
Galanin receptor type 2
Synonyms:
GALNR2 GALR2_HUMAN Galanin receptor 2 Galanin receptor type 2 (GAL2-R) (GALR2).
Type:
Enzyme Catalytic Domain
Mol. Mass.:
41724.40
Organism:
Homo sapiens (Human)
Description:
Galanin R2 GALR2 HUMAN::O43603
Residue:
387
  
Inhibitor
Name:
BDBM42067
Synonyms:
6-ethyl-9-methyl-2-indolo[2,3-b]quinoxalinecarboxylic acid 6-ethyl-9-methylindolo[2,3-b]quinoxaline-2-carboxylic acid SMR000247715 | cid_4881923
Type:
Small organic molecule
Emp. Form.:
C18H15N3O2
Mol. Mass.:
305.3306
SMILES:
CCn1c2ccc(C)cc2c2nc3cc(ccc3nc12)C(O)=O
: