Target
Glyceraldehyde-3-phosphate dehydrogenase
Ligand
BDBM31729
Substrate
Meas. Tech.
GAPDH Dose Response Colorimetric Assay
IC50
28700±2170 nM
Citation
 PubChem, PC GAPDH Dose Response Colorimetric Assay PubChem Bioassay (2008)[AID] 
Target
Name:
Glyceraldehyde-3-phosphate dehydrogenase
Synonyms:
G3P_HUMAN GAPDH glyceraldehyde-3-phosphate dehydrogenase
Type:
PROTEIN
Mol. Mass.:
36060.86
Organism:
Homo sapiens (Human)
Description:
ChEMBL_1511315
Residue:
335
  
Inhibitor
Name:
BDBM31729
Synonyms:
8-bromanyl-3a,4,5,9b-tetrahydro-3H-cyclopenta[c]quinoline-4-carboxylic acid CHEMBL201289 cid_3136927
Type:
Small organic molecule
Emp. Form.:
C13H12BrNO2
Mol. Mass.:
294.144
SMILES:
OC(=O)C1Nc2ccc(Br)cc2C2C=CCC12
: