Target
Glyceraldehyde-3-phosphate dehydrogenase
Ligand
BDBM31740
Substrate
Meas. Tech.
GAPDH Dose Response Colorimetric Assay
IC50
76800±7370 nM
Citation
 PubChem, PC GAPDH Dose Response Colorimetric Assay PubChem Bioassay (2008)[AID] 
Target
Name:
Glyceraldehyde-3-phosphate dehydrogenase
Synonyms:
G3P_HUMAN GAPDH glyceraldehyde-3-phosphate dehydrogenase
Type:
PROTEIN
Mol. Mass.:
36060.86
Organism:
Homo sapiens (Human)
Description:
ChEMBL_1511315
Residue:
335
  
Inhibitor
Name:
BDBM31740
Synonyms:
8-(2-naphthoxycarbonyl)-3a,4,5,9b-tetrahydro-3H-cyclopenta[c]quinoline-4-carboxylic acid 8-naphthalen-2-yloxycarbonyl-3a,4,5,9b-tetrahydro-3H-cyclopenta[c]quinoline-4-carboxylic acid cid_2914536
Type:
Small organic molecule
Emp. Form.:
C24H19NO4
Mol. Mass.:
385.412
SMILES:
OC(=O)C1Nc2ccc(cc2C2C=CCC12)C(=O)Oc1ccc2ccccc2c1
: